Target
Sigma non-opioid intracellular receptor 1
Ligand
BDBM314380
Substrate
Meas. Tech.
Binding Assay
Ki
133±n/a nM
Citation
 Torrens-Jover, AChristmann, UDiaz-Fernández, JAlmansa-Rosales, C 1,2,3-triazole-4-amine derivatives for the treatment of sigma receptor related diseases and disorders US Patent  US9611229 Publication Date 4/4/2017 
Target
Name:
Sigma non-opioid intracellular receptor 1
Synonyms:
Opioid receptor, sigma 1 SGMR1_MOUSE Sigma1-receptor Sigmar1
Type:
Enzyme Catalytic Domain
Mol. Mass.:
25246.51
Organism:
Mus musculus (Mouse)
Description:
O55242
Residue:
223
  
Inhibitor
Name:
BDBM314380
Synonyms:
N-(2-(4- cyclohexylpiperazin- 1-yl)ethyl)-1-(4- fluorobenzyl)-1H- 1,2,3-triazol-4-amine | US9611229, 34
Type:
Small organic molecule
Emp. Form.:
C21H31FN6
Mol. Mass.:
386.5094
SMILES:
Fc1ccc(Cn2cc(NCCN3CCN(CC3)C3CCCCC3)nn2)cc1
: