Target
MAP kinase-interacting serine/threonine-protein kinase 1
Ligand
BDBM164270
Substrate
Meas. Tech.
Mnk Biochemical Enzymatic Assay
Temperature
298.15±n/a K
IC50
55±n/a nM
Comments
extracted
Citation
 Reich, SHSprengeler, PAWebber, SEXiang, AXErnst, JT MNK inhibitors and methods related thereto US Patent  US9669031 Publication Date 6/6/2017 
Target
Name:
MAP kinase-interacting serine/threonine-protein kinase 1
Synonyms:
MAP Kinase-Interacting Protein Kinase (MNK1) MAP kinase-interacting serine/threonine-protein kinase 1 (MnK1) MAP-kinase interacting kinase 1 (MNK1) MKNK1 MNK1
Type:
Serine/threonine-protein kinase
Mol. Mass.:
51342.85
Organism:
Homo sapiens (Human)
Description:
Q9BUB5
Residue:
465
  
Inhibitor
Name:
BDBM164270
Synonyms:
US9669031, 9 3-cyclopentyl-3-methyl-6-(pyrimidin-4-ylamino)-2,3-dihydroimidazo[1,5-a]pyridine-1,5-dione (Cpd. No. 9)
Type:
Small organic molecule
Emp. Form.:
C17H19N5O2
Mol. Mass.:
325.3651
SMILES:
CC1(NC(=O)c2ccc(Nc3ccncn3)c(=O)n12)C1CCCC1
: