Target
MAP kinase-interacting serine/threonine-protein kinase 1
Ligand
BDBM164600
Substrate
Meas. Tech.
Mnk Biochemical Enzymatic Assay
Temperature
298.15±n/a K
IC50
<10.00±n/a nM
Comments
extracted
Citation
 Reich, SHSprengeler, PAWebber, SEXiang, AXErnst, JT MNK inhibitors and methods related thereto US Patent  US9669031 Publication Date 6/6/2017 
Target
Name:
MAP kinase-interacting serine/threonine-protein kinase 1
Synonyms:
MAP Kinase-Interacting Protein Kinase (MNK1) MAP kinase-interacting serine/threonine-protein kinase 1 (MnK1) MAP-kinase interacting kinase 1 (MNK1) MKNK1 MNK1
Type:
Serine/threonine-protein kinase
Mol. Mass.:
51342.85
Organism:
Homo sapiens (Human)
Description:
Q9BUB5
Residue:
465
  
Inhibitor
Name:
BDBM164600
Synonyms:
US9669031, 21 N-[6-[(1,5-dioxospiro[2H-imidazo[1,5-a]pyridine-3,1′-cyclopentane]-6-yl)amino]pyrimidin-4-yl]cyclopropanecarboxamide (Cpd. No. 21)
Type:
Small organic molecule
Emp. Form.:
C19H20N6O3
Mol. Mass.:
380.4005
SMILES:
O=C(Nc1cc(Nc2ccc3C(=O)NC4(CCCC4)n3c2=O)ncn1)C1CC1
: