Target
MAP kinase-interacting serine/threonine-protein kinase 2
Ligand
BDBM164608
Substrate
Meas. Tech.
Mnk Biochemical Enzymatic Assay
Temperature
298.15±n/a K
IC50
<10.00±n/a nM
Comments
extracted
Citation
 Reich, SHSprengeler, PAWebber, SEXiang, AXErnst, JT MNK inhibitors and methods related thereto US Patent  US9669031 Publication Date 6/6/2017 
Target
Name:
MAP kinase-interacting serine/threonine-protein kinase 2
Synonyms:
GPRK7 MAP kinase-interacting serine/threonine-protein kinase 2 (MKNK2) MAP-kinase interacting kinase 2 (MNK2) MKNK2_HUMAN | MNK2
Type:
Protein
Mol. Mass.:
51870.79
Organism:
Homo sapiens (Human)
Description:
Q9HBH9
Residue:
465
  
Inhibitor
Name:
BDBM164608
Synonyms:
US9669031, 118 6-[(6-aminopyrimidin-4-yl)amino]-3-cyclopentyl-3-methyl-1,5-dioxo-imidazo[1,5-a]pyridine-2-carbonitrile (Cpd. No. 118) | US9669031, 23 N-[6-[(3-cyclopentyl-3-methyl-1,5-dioxo-2H-imidazo[1,5-a]pyridin-6-yl)amino]pyrimidin-4-yl]cyclopropanecarboxamide (Cpd. No. 23)
Type:
Small organic molecule
Emp. Form.:
C21H24N6O3
Mol. Mass.:
408.4537
SMILES:
CC1(NC(=O)c2ccc(Nc3cc(NC(=O)C4CC4)ncn3)c(=O)n12)C1CCCC1
: