Target
MAP kinase-interacting serine/threonine-protein kinase 1
Ligand
BDBM168246
Substrate
Meas. Tech.
Mnk Biochemical Enzymatic Assay
Temperature
298.15±n/a K
IC50
<10.00±n/a nM
Comments
extracted
Citation
 Reich, SHSprengeler, PAWebber, SEXiang, AXErnst, JT MNK inhibitors and methods related thereto US Patent  US9669031 Publication Date 6/6/2017 
Target
Name:
MAP kinase-interacting serine/threonine-protein kinase 1
Synonyms:
MAP Kinase-Interacting Protein Kinase (MNK1) MAP kinase-interacting serine/threonine-protein kinase 1 (MnK1) MAP-kinase interacting kinase 1 (MNK1) MKNK1 MNK1
Type:
Serine/threonine-protein kinase
Mol. Mass.:
51342.85
Organism:
Homo sapiens (Human)
Description:
Q9BUB5
Residue:
465
  
Inhibitor
Name:
BDBM168246
Synonyms:
US9669031, 74 8-chloro-3-methyl-3-(2-pyridyl)-6-(pyrimidin-4-ylamino)-2H-imidazo[1,5-a]pyridine-1,5-dione (Cpd. No. 74)
Type:
Small organic molecule
Emp. Form.:
C17H13ClN6O2
Mol. Mass.:
368.777
SMILES:
CC1(NC(=O)c2c(Cl)cc(Nc3ccncn3)c(=O)n12)c1ccccn1
: