Target
MAP kinase-interacting serine/threonine-protein kinase 1
Ligand
BDBM168279
Substrate
Meas. Tech.
Mnk Biochemical Enzymatic Assay
Temperature
298.15±n/a K
IC50
<10.00±n/a nM
Comments
extracted
Citation
 Reich, SHSprengeler, PAWebber, SEXiang, AXErnst, JT MNK inhibitors and methods related thereto US Patent  US9669031 Publication Date 6/6/2017 
Target
Name:
MAP kinase-interacting serine/threonine-protein kinase 1
Synonyms:
MAP Kinase-Interacting Protein Kinase (MNK1) MAP kinase-interacting serine/threonine-protein kinase 1 (MnK1) MAP-kinase interacting kinase 1 (MNK1) MKNK1 MNK1
Type:
Serine/threonine-protein kinase
Mol. Mass.:
51342.85
Organism:
Homo sapiens (Human)
Description:
Q9BUB5
Residue:
465
  
Inhibitor
Name:
BDBM168279
Synonyms:
US9669031, 107 6′-((6-aminopyrimidin-4-yl)amino)-8′-methyl-2′H-spiro[cyclohexane-1,3′-imidazo[1,5-a]pyridine]-1′,5′-dione hydrochloride (Cpd. No. 107)
Type:
Small organic molecule
Emp. Form.:
C22H28N6O4
Mol. Mass.:
440.4955
SMILES:
Cc1cc(Nc2cc(NC(=O)OC(C)(C)C)ncn2)c(=O)n2c1C(=O)NC21CCCCC1
: