Target
MAP kinase-interacting serine/threonine-protein kinase 1
Ligand
BDBM168299
Substrate
Meas. Tech.
Mnk Biochemical Enzymatic Assay
Temperature
298.15±n/a K
IC50
<10.00±n/a nM
Comments
extracted
Citation
 Reich, SHSprengeler, PAWebber, SEXiang, AXErnst, JT MNK inhibitors and methods related thereto US Patent  US9669031 Publication Date 6/6/2017 
Target
Name:
MAP kinase-interacting serine/threonine-protein kinase 1
Synonyms:
MAP Kinase-Interacting Protein Kinase (MNK1) MAP kinase-interacting serine/threonine-protein kinase 1 (MnK1) MAP-kinase interacting kinase 1 (MNK1) MKNK1 MNK1
Type:
Serine/threonine-protein kinase
Mol. Mass.:
51342.85
Organism:
Homo sapiens (Human)
Description:
Q9BUB5
Residue:
465
  
Inhibitor
Name:
BDBM168299
Synonyms:
US9669031, 126 6-((6-aminopyrimidin-4-yl)amino)-8-chloro-2H-spiro[imidazo[1,5-a]pyridine-3,6′-[1,4]diazepane]-1,5-dione (Cpd. No. 126)
Type:
Small organic molecule
Emp. Form.:
C14H15ClN8O2
Mol. Mass.:
362.774
SMILES:
Nc1cc(Nc2cc(Cl)c3C(=O)NC4(CNCNC4)n3c2=O)ncn1
: