Target
Glycogen synthase kinase-3 beta
Ligand
BDBM314400
Substrate
Meas. Tech.
In Vitro Assay
IC50
960±n/a nM
Citation
 Alisi, MACazzolla, NDragone, PFurlotti, GMaugeri, COmbrato, RMancini, F 1H-indazole-3-carboxamide compounds as glycogen synthase kinase 3 beta inhibitors US Patent  US9611249 Publication Date 4/4/2017 
Target
Name:
Glycogen synthase kinase-3 beta
Synonyms:
GSK-3 beta GSK3B Glycogen synthase kinase 3 beta (GSK3B) Glycogen synthase kinase-3 beta (GSK-3B) Glycogen synthase kinase-3 beta (GSK3B) Glycogen synthase kinase-3beta (GSK3B) | Serine/threonine-protein kinase GSK3B
Type:
Enzyme
Mol. Mass.:
46756.38
Organism:
Homo sapiens (Human)
Description:
P49841
Residue:
420
  
Inhibitor
Name:
BDBM314400
Synonyms:
US9611249, Compound 31 | [4-({[(5-ethyl-1H-indazol-3- yl)carbonyl]amino}methyl)piperidin-1- yl]acetic acid
Type:
Small organic molecule
Emp. Form.:
C18H24N4O3
Mol. Mass.:
344.4082
SMILES:
CCc1ccc2[nH]nc(C(=O)NCC3CCN(CC(O)=O)CC3)c2c1
: