Target
Acetylcholinesterase
Ligand
BDBM10590
Substrate
BDBM8959
Meas. Tech.
Enzyme Inhibition Assay
pH
8±n/a
Temperature
298.15±n/a K
IC50
0.29±0.01 nM
Citation
 Camps, PFormosa, XMunoz-Torrero, DPetrignet, JBadia, AClos, MV Synthesis and pharmacological evaluation of huprine-tacrine heterodimers: subnanomolar dual binding site acetylcholinesterase inhibitors. J Med Chem 48:1701-4 (2005)  
Target
Name:
Acetylcholinesterase
Synonyms:
ACES_HUMAN Acetylcholinesterase (AChE) | Acetylcholinesterase (human AChE)
Type:
Enzyme
Mol. Mass.:
67792.70
Organism:
Homo sapiens (Human)
Description:
P22303
Residue:
614
  
Inhibitor
Name:
BDBM10590
Synonyms:
3-Chloro-6,7,10,11-tetrahydro-9-methyl-12-{{3-{N-{3-[(6-chloro-1,2,3,4-tetrahydroacridin-9-yl)amino]propyl}-N-methylamino}propyl}amino}-7,11-methanocycloocta[b]quinoline trihydrochloride Huprine-Tacrine Heterodimer 18d | {3-[(6-chloro-1,2,3,4-tetrahydroacridin-9-yl)amino]propyl}[3-({7-chloro-15-methyl-10-azatetracyclo[11.3.1.0^{2,11}.0^{4,9}]heptadeca-2(11),3,5,7,9,14-hexaen-3-yl}amino)propyl]methylamine trihydrochloride
Type:
Small organic molecule
Emp. Form.:
C37H43Cl2N5
Mol. Mass.:
628.677
SMILES:
CN(CCCNc1c2CCCCc2nc2cc(Cl)ccc12)CCCNc1c2C3CC(Cc2nc2cc(Cl)ccc12)C=C(C)C3
:
Substrate
Name:
BDBM8959
Synonyms:
(2-Mercaptoethyl)trimethylammonium iodide acetate Acetylthiocholine acetylthiocholine chloride | acetylthiocholine iodide
Type:
Small organic molecule
Emp. Form.:
C7H16NOS
Mol. Mass.:
162.272
SMILES:
CC(=O)SCC[N+](C)(C)C
: