Target
Orexin/Hypocretin receptor type 1
Ligand
BDBM175130
Substrate
Meas. Tech.
Receptor Radioligand Binding Studies
Ki
12.0±n/a nM
Citation
 Coate, HRDvorak, CAPreville, CShireman, BT Substituted piperidine compounds and their use as orexin receptor modulators US Patent  US9611251 Publication Date 4/4/2017 
Target
Name:
Orexin/Hypocretin receptor type 1
Synonyms:
HCRTR1 OX1R_HUMAN Orexin receptor type 1 (OR 1) Orexin receptor type 1 (OX1) Orexin receptor type 1 (OxR1) | Ox1r
Type:
Protein
Mol. Mass.:
47554.50
Organism:
Homo sapiens (Human)
Description:
O43613
Residue:
425
  
Inhibitor
Name:
BDBM175130
Synonyms:
US9115117, 100 US9611251, 100
Type:
Small organic molecule
Emp. Form.:
C20H21ClN6O
Mol. Mass.:
396.873
SMILES:
C[C@H]1[C@@H](CCCN1C(=O)c1ccccc1-n1nccn1)Nc1ccc(Cl)cn1
: