Target
Orexin/Hypocretin receptor type 1
Ligand
BDBM175136
Substrate
Meas. Tech.
Receptor Radioligand Binding Studies
Ki
10.00±n/a nM
Citation
 Coate, HRDvorak, CAPreville, CShireman, BT Substituted piperidine compounds and their use as orexin receptor modulators US Patent  US9611251 Publication Date 4/4/2017 
Target
Name:
Orexin/Hypocretin receptor type 1
Synonyms:
HCRTR1 OX1R_HUMAN Orexin receptor type 1 (OR 1) Orexin receptor type 1 (OX1) Orexin receptor type 1 (OxR1) | Ox1r
Type:
Protein
Mol. Mass.:
47554.50
Organism:
Homo sapiens (Human)
Description:
O43613
Residue:
425
  
Inhibitor
Name:
BDBM175136
Synonyms:
US9115117, 38 US9611251, 85
Type:
Small organic molecule
Emp. Form.:
C20H20F3N7O
Mol. Mass.:
431.4143
SMILES:
C[C@H]1[C@@H](CCCN1C(=O)c1ccccc1-n1nccn1)Nc1cnc(cn1)C(F)(F)F
: