Target
Plasma kallikrein
Ligand
BDBM283470
Substrate
Meas. Tech.
In Vitro Enzyme Inhibition Assay
IC50
<100±n/a nM
Citation
 McDonald, AQian, S Therapeutic inhibitory compounds US Patent  US9611252 Publication Date 4/4/2017 
Target
Name:
Plasma kallikrein
Synonyms:
Fletcher factor KLKB1 Kallikrein Plasma kallikrein heavy chain Plasma prekallikrein
Type:
Protein
Mol. Mass.:
71391.16
Organism:
Homo sapiens (Human)
Description:
P03952
Residue:
638
  
Inhibitor
Name:
BDBM283470
Synonyms:
N-((6-amino-2,4-dimethylpyridin-3-yl)methyl)- 2-((7-fluoroquinolin-3- yl)methyl)isonicotinamide US10266515, Example 122 US11021463, Example 122 | US9611252, Example 122
Type:
Small organic molecule
Emp. Form.:
C24H22FN5O
Mol. Mass.:
415.4628
SMILES:
Cc1cc(N)nc(C)c1CNC(=O)c1ccnc(Cc2cnc3cc(F)ccc3c2)c1
: