Target
Plasma kallikrein
Ligand
BDBM283473
Substrate
Meas. Tech.
In Vitro Enzyme Inhibition Assay
IC50
<100±n/a nM
Citation
 McDonald, AQian, S Therapeutic inhibitory compounds US Patent  US9611252 Publication Date 4/4/2017 
Target
Name:
Plasma kallikrein
Synonyms:
Fletcher factor KLKB1 Kallikrein Plasma kallikrein heavy chain Plasma prekallikrein
Type:
Protein
Mol. Mass.:
71391.16
Organism:
Homo sapiens (Human)
Description:
P03952
Residue:
638
  
Inhibitor
Name:
BDBM283473
Synonyms:
N-((3-chloro-6-fluoro-1H-indol-5-yl)methyl)-2- (quinolin-3-ylmethyl)isonicotinamide US10266515, Example 125 US11021463, Example 125 | US9611252, Example 125
Type:
Small organic molecule
Emp. Form.:
C25H18ClFN4O
Mol. Mass.:
444.888
SMILES:
Fc1cc2[nH]cc(Cl)c2cc1CNC(=O)c1ccnc(Cc2cnc3ccccc3c2)c1
: