Target
Plasma kallikrein
Ligand
BDBM283477
Substrate
Meas. Tech.
In Vitro Enzyme Inhibition Assay
IC50
550±n/a nM
Citation
 McDonald, AQian, S Therapeutic inhibitory compounds US Patent  US9611252 Publication Date 4/4/2017 
Target
Name:
Plasma kallikrein
Synonyms:
Fletcher factor KLKB1 Kallikrein Plasma kallikrein heavy chain Plasma prekallikrein
Type:
Protein
Mol. Mass.:
71391.16
Organism:
Homo sapiens (Human)
Description:
P03952
Residue:
638
  
Inhibitor
Name:
BDBM283477
Synonyms:
N-((6-amino-2,4-dimethylpyridin-3-yl)methyl)- 2-((2-methylquinolin-7- yl)methyl)isonicotinamide US10266515, Example 129 US11021463, Example 129 | US9611252, Example 129
Type:
Small organic molecule
Emp. Form.:
C25H25N5O
Mol. Mass.:
411.4989
SMILES:
Cc1ccc2ccc(Cc3cc(ccn3)C(=O)NCc3c(C)cc(N)nc3C)cc2n1
: