Target
Cyclin-dependent kinase 2/G1/S-specific cyclin-E1
Ligand
BDBM10633
Substrate
Histone H1
Meas. Tech.
Kinase Inhibition Assay
pH
7.4±n/a
Temperature
303.15±n/a K
IC50
800±n/a nM
Citation
 Otyepka, MKrystof, VHavlicek, LSiglerova, VStrnad, MKoca, J Docking-based development of purine-like inhibitors of cyclin-dependent kinase-2. J Med Chem 43:2506-13 (2000)  
Target
Name:
Cyclin-dependent kinase 2/G1/S-specific cyclin-E1
Synonyms:
CDK2/CycE CDK2/E Cyclin-Dependent Kinase 2 (CDK2) Cyclin-dependent kinase 2/cyclin E1
Type:
Protein
Mol. Mass.:
Description:
Components:
This complex has 2 components.
Component 1
Name:
Cyclin-dependent kinase 2
Synonyms:
CDK2 CDK2_HUMAN Cell division protein kinase 2 Protein cereblon/Cyclin-dependent kinase 2 | p33 protein kinase
Type:
Enzyme Subunit
Mol. Mass.:
33938.17
Organism:
Homo sapiens (Human)
Description:
P24941
Residue:
298
  
Component 2
Name:
G1/S-specific cyclin-E1
Synonyms:
CCNE CCNE1_HUMAN
Type:
Enzyme Subunit
Mol. Mass.:
47073.17
Organism:
Homo sapiens (Human)
Description:
Residue:
410
  
Inhibitor
Name:
BDBM10633
Synonyms:
3-{[6-(benzylamino)-9-(propan-2-yl)-9H-purin-2-yl]amino}propan-1-ol 6-(benzylamino)-2-[(3-hydroxypropyl)amino]-9-isopropylpurine purine deriv. 1
Type:
Small organic molecule
Emp. Form.:
C18H24N6O
Mol. Mass.:
340.4228
SMILES:
CC(C)n1cnc2c(NCc3ccccc3)nc(NCCCO)nc12
:
Substrate
Name:
Histone H1
Synonyms:
Type:
Other Protein Type
Mol. Mass.:
358.43
Organism:
Bos taurus (bovine)
Description:
Residue:
3
NA