Target
Orexin/Hypocretin receptor type 1
Ligand
BDBM314616
Substrate
Meas. Tech.
Receptor Radioligand Binding Assay
Ki
5.00±n/a nM
Citation
 Shireman, BTLebold, TPDvorak, CACoate, HRZiff, JMPreville, CGelin, CChen, G Substituted 2-azabicycles and their use as orexin receptor modulators US Patent  US9611262 Publication Date 4/4/2017 
Target
Name:
Orexin/Hypocretin receptor type 1
Synonyms:
HCRTR1 OX1R_HUMAN Orexin receptor type 1 (OR 1) Orexin receptor type 1 (OX1) Orexin receptor type 1 (OxR1) | Ox1r
Type:
Protein
Mol. Mass.:
47554.50
Organism:
Homo sapiens (Human)
Description:
O43613
Residue:
425
  
Inhibitor
Name:
BDBM314616
Synonyms:
US9611262, Example 110 | [(1R,2R,4S,5R)-5-[[5-(difluoromethyl)-2-pyridyl]oxy]-2-methyl-3-azabicyclo[2.2.1]heptan-3-yl]-[6-methyl-3-(triazol-2-yl)-2-pyridyl]methanone
Type:
Small organic molecule
Emp. Form.:
C22H22F2N6O2
Mol. Mass.:
440.4459
SMILES:
CC1C2CC(Oc3ccc(cn3)C(F)F)C(C2)N1C(=O)c1nc(C)ccc1-n1nccn1
: