Target
Orexin/Hypocretin receptor type 1
Ligand
BDBM314617
Substrate
Meas. Tech.
Receptor Radioligand Binding Assay
Ki
4.00±n/a nM
Citation
 Shireman, BTLebold, TPDvorak, CACoate, HRZiff, JMPreville, CGelin, CChen, G Substituted 2-azabicycles and their use as orexin receptor modulators US Patent  US9611262 Publication Date 4/4/2017 
Target
Name:
Orexin/Hypocretin receptor type 1
Synonyms:
HCRTR1 OX1R_HUMAN Orexin receptor type 1 (OR 1) Orexin receptor type 1 (OX1) Orexin receptor type 1 (OxR1) | Ox1r
Type:
Protein
Mol. Mass.:
47554.50
Organism:
Homo sapiens (Human)
Description:
O43613
Residue:
425
  
Inhibitor
Name:
BDBM314617
Synonyms:
US9611262, Example 121 [(1R,2R,4S,5R)-5-[(5-chloro-2-pyridyl)oxy]-2-methyl-3-azabicyclo[2.2.1]heptan-3-yl]-[2-(triazol-2-yl)phenyl]methanone
Type:
Small organic molecule
Emp. Form.:
C21H20ClN5O2
Mol. Mass.:
409.869
SMILES:
CC1C2CC(Oc3ccc(Cl)cn3)C(C2)N1C(=O)c1ccccc1-n1nccn1
: