Target
Orexin/Hypocretin receptor type 1
Ligand
BDBM314418
Substrate
Meas. Tech.
Receptor Radioligand Binding Assay
Ki
5.00±n/a nM
Citation
 Shireman, BTLebold, TPDvorak, CACoate, HRZiff, JMPreville, CGelin, CChen, G Substituted 2-azabicycles and their use as orexin receptor modulators US Patent  US9611262 Publication Date 4/4/2017 
Target
Name:
Orexin/Hypocretin receptor type 1
Synonyms:
HCRTR1 OX1R_HUMAN Orexin receptor type 1 (OR 1) Orexin receptor type 1 (OX1) Orexin receptor type 1 (OxR1) | Ox1r
Type:
Protein
Mol. Mass.:
47554.50
Organism:
Homo sapiens (Human)
Description:
O43613
Residue:
425
  
Inhibitor
Name:
BDBM314418
Synonyms:
(R/S)-(6-methyl-3-(2H-1,2,3-triazol-2-yl)pyridin-2-yl)(3-methyl-6-((5-(trifluoromethyl)pyridin-2-yl)oxy)-2-azabicyclo[2.2.1]heptan-2-yl)methanone US9611262, Example 198 US9611262, Example 22B US9611262, Example 3A | US9611262, Example 3B
Type:
Small organic molecule
Emp. Form.:
C22H21F3N6O2
Mol. Mass.:
458.4363
SMILES:
CC1C2CC(Oc3ccc(cn3)C(F)(F)F)C(C2)N1C(=O)c1nc(C)ccc1-n1nccn1
: