Target
Macrophage colony-stimulating factor 1 receptor
Ligand
BDBM164911
Substrate
Meas. Tech.
c-FMS Activity
IC50
2.00±n/a nM
Citation
 Kane, Jr., JLMatthews, GMetz, MKothe, MLiu, JScholte, A Tropomyosin-related kinase (TRK) inhibitors US Patent  US9611265 Publication Date 4/4/2017 
Target
Name:
Macrophage colony-stimulating factor 1 receptor
Synonyms:
CSF1R FMS Macrophage colony stimulating factor receptor Macrophage colony-stimulating factor 1 receptor (c-FMS) Proto-oncogene c-Fms c-fms | cFMS
Type:
Protein
Mol. Mass.:
107979.48
Organism:
Homo sapiens (Human)
Description:
P07333
Residue:
972
  
Inhibitor
Name:
BDBM164911
Synonyms:
US10166239, Ex. 3-19 US9067914, Ex. 3-19
Type:
Small organic molecule
Emp. Form.:
C29H31N7O3
Mol. Mass.:
525.6015
SMILES:
COc1ccc(COc2ccc(Cn3cnc4cc(cnc34)-c3cnn(c3)C3CCNCC3)cc2OC)cn1
: