Target
BDNF/NT-3 growth factors receptor
Ligand
BDBM164936
Substrate
Meas. Tech.
TrkB Activity
IC50
13.0±n/a nM
Citation
 Kane, Jr., JLMatthews, GMetz, MKothe, MLiu, JScholte, A Tropomyosin-related kinase (TRK) inhibitors US Patent  US9611265 Publication Date 4/4/2017 
Target
Name:
BDNF/NT-3 growth factors receptor
Synonyms:
GP145-TrkB NTRK2 Neurotrophic tyrosine kinase receptor type 2 Trk-B Tropomyosin-related kinase B Tyrosine kinase receptor B (Trk-B)
Type:
Enzyme
Mol. Mass.:
91996.87
Organism:
Homo sapiens (Human)
Description:
Q16620
Residue:
822
  
Inhibitor
Name:
BDBM164936
Synonyms:
US10166239, Ex. 3-37-4 US9067914, Ex. 3-37-4
Type:
Small organic molecule
Emp. Form.:
C27H29N7O3
Mol. Mass.:
499.5643
SMILES:
COc1ccc(COc2ccc(Cn3c(N)nc4cc(cnc34)-c3c(C)nn(C)c3C)cc2OC)cn1
: