Target
BDNF/NT-3 growth factors receptor
Ligand
BDBM164941
Substrate
Meas. Tech.
TrkB Activity
IC50
0.200±n/a nM
Citation
 Kane, Jr., JLMatthews, GMetz, MKothe, MLiu, JScholte, A Tropomyosin-related kinase (TRK) inhibitors US Patent  US9611265 Publication Date 4/4/2017 
Target
Name:
BDNF/NT-3 growth factors receptor
Synonyms:
GP145-TrkB NTRK2 Neurotrophic tyrosine kinase receptor type 2 Trk-B Tropomyosin-related kinase B Tyrosine kinase receptor B (Trk-B)
Type:
Enzyme
Mol. Mass.:
91996.87
Organism:
Homo sapiens (Human)
Description:
Q16620
Residue:
822
  
Inhibitor
Name:
BDBM164941
Synonyms:
US10166239, Ex. 3-40-1 US9067914, Ex. 3-40-1
Type:
Small organic molecule
Emp. Form.:
C26H23F3N6O3
Mol. Mass.:
524.4944
SMILES:
COc1cc(Cn2c(N)nc3cc(cnc23)-c2cnn(C)c2)ccc1OCc1ccc(OC(F)(F)F)cc1
: