Target
BDNF/NT-3 growth factors receptor
Ligand
BDBM164949
Substrate
Meas. Tech.
TrkB Activity
IC50
41.0±n/a nM
Citation
 Kane, Jr., JLMatthews, GMetz, MKothe, MLiu, JScholte, A Tropomyosin-related kinase (TRK) inhibitors US Patent  US9611265 Publication Date 4/4/2017 
Target
Name:
BDNF/NT-3 growth factors receptor
Synonyms:
GP145-TrkB NTRK2 Neurotrophic tyrosine kinase receptor type 2 Trk-B Tropomyosin-related kinase B Tyrosine kinase receptor B (Trk-B)
Type:
Enzyme
Mol. Mass.:
91996.87
Organism:
Homo sapiens (Human)
Description:
Q16620
Residue:
822
  
Inhibitor
Name:
BDBM164949
Synonyms:
US10166239, Ex. 3-44 US9067914, Ex. 344
Type:
Small organic molecule
Emp. Form.:
C28H29N7O3
Mol. Mass.:
511.575
SMILES:
COc1cc2CCCC(Oc3ccc(Cn4c(N)nc5cc(cnc45)-c4cnn(C)c4)cc3OC)c2cn1
: