Target
BDNF/NT-3 growth factors receptor
Ligand
BDBM314760
Substrate
Meas. Tech.
TrkB Activity
IC50
0.600±n/a nM
Citation
 Kane, Jr., JLMatthews, GMetz, MKothe, MLiu, JScholte, A Tropomyosin-related kinase (TRK) inhibitors US Patent  US9611265 Publication Date 4/4/2017 
Target
Name:
BDNF/NT-3 growth factors receptor
Synonyms:
GP145-TrkB NTRK2 Neurotrophic tyrosine kinase receptor type 2 Trk-B Tropomyosin-related kinase B Tyrosine kinase receptor B (Trk-B)
Type:
Enzyme
Mol. Mass.:
91996.87
Organism:
Homo sapiens (Human)
Description:
Q16620
Residue:
822
  
Inhibitor
Name:
BDBM314760
Synonyms:
US9611265, Ex. 3-49
Type:
Small organic molecule
Emp. Form.:
C27H25F3N6O2
Mol. Mass.:
522.5216
SMILES:
COc1cc(ccc1OCc1ccc(cc1)C(F)(F)F)C(C)n1c(N)nc2cc(cnc12)-c1cnn(C)c1
: