Target
Fibroblast growth factor receptor 2
Ligand
BDBM301292
Substrate
Meas. Tech.
Enzymatic Assay
IC50
<100±n/a nM
Citation
 Wu, LZhang, CHe, CLu, LYao, W Substituted tricyclic compounds as FGFR inhibitors US Patent  US9611267 Publication Date 4/4/2017 
Target
Name:
Fibroblast growth factor receptor 2
Synonyms:
BEK FGFR-2 FGFR2 Fibroblast growth factor receptor 2 (FGFR2) KGFR Keratinocyte growth factor receptor VEGF-receptor 2 and Fibroblast growth factor receptor 2
Type:
Enzyme
Mol. Mass.:
92015.45
Organism:
Homo sapiens (Human)
Description:
P21802
Residue:
821
  
Inhibitor
Name:
BDBM301292
Synonyms:
3-(2-chloro-6-fluoro-3,5-dimethoxyphenyl)-1-pyridin-3-yl-1,3,4,7-tetrahydro-2H-pyrrolo[3',2':5,6]pyrido[4,3-d]pyrimidin-2-one US11053246, Example 108 | US9611267, Example 108
Type:
Small organic molecule
Emp. Form.:
C22H17ClFN5O3
Mol. Mass.:
453.853
SMILES:
COc1cc(OC)c(Cl)c(N2Cc3cnc4[nH]ccc4c3N(C2=O)c2cccnc2)c1F
: