Target
Fibroblast growth factor receptor 3
Ligand
BDBM301322
Substrate
Meas. Tech.
Enzymatic Assay
IC50
<100±n/a nM
Citation
 Wu, LZhang, CHe, CLu, LYao, W Substituted tricyclic compounds as FGFR inhibitors US Patent  US9611267 Publication Date 4/4/2017 
Target
Name:
Fibroblast growth factor receptor 3
Synonyms:
CD_antigen: CD333 FGFR3 Fibroblast growth factor receptor JTK4
Type:
Protein
Mol. Mass.:
87699.57
Organism:
Homo sapiens (Human)
Description:
P22607
Residue:
806
  
Inhibitor
Name:
BDBM301322
Synonyms:
3-(2,6-difluoro-3,5-dimethoxyphenyl)-1-methyl-8-(1H-pyrazol-1-ylmethyl)-1,3,4,7-tetrahydro-2H-pyrrolo[3',2':5,6]pyrido[4,3-d]pyrimidin-2-one US11053246, Example 138 | US9611267, Example 138
Type:
Small organic molecule
Emp. Form.:
C22H20F2N6O3
Mol. Mass.:
454.4294
SMILES:
COc1cc(OC)c(F)c(N2Cc3cnc4[nH]c(Cn5cccn5)cc4c3N(C)C2=O)c1F
: