Target
Fibroblast growth factor receptor 2
Ligand
BDBM301351
Substrate
Meas. Tech.
Enzymatic Assay
IC50
<100±n/a nM
Citation
 Wu, LZhang, CHe, CLu, LYao, W Substituted tricyclic compounds as FGFR inhibitors US Patent  US9611267 Publication Date 4/4/2017 
Target
Name:
Fibroblast growth factor receptor 2
Synonyms:
BEK FGFR-2 FGFR2 Fibroblast growth factor receptor 2 (FGFR2) KGFR Keratinocyte growth factor receptor VEGF-receptor 2 and Fibroblast growth factor receptor 2
Type:
Enzyme
Mol. Mass.:
92015.45
Organism:
Homo sapiens (Human)
Description:
P21802
Residue:
821
  
Inhibitor
Name:
BDBM301351
Synonyms:
3-(2,6-Difluoro-3,5-dimethoxyphenyl)-1-[(2S)-tetrahydrofuran-2-ylmethyl]-1,3,4,7-tetrahydro-2H-pyrazolo[4',3':5,6]pyrido[4,3-d]pyrimidin-2-one US11053246, Example 167 | US9611267, Example 167
Type:
Small organic molecule
Emp. Form.:
C21H21F2N5O4
Mol. Mass.:
445.4193
SMILES:
COc1cc(OC)c(F)c(N2Cc3cnc4[nH]ncc4c3N(C[C@@H]3CCCO3)C2=O)c1F
: