Target
Tyrosine-protein kinase JAK1
Ligand
BDBM314711
Substrate
Meas. Tech.
In Vitro Assay
IC50
<10±n/a nM
Citation
 Yao, WBurns, DZhuo, J Azetidinyl phenyl, pyridyl or pyrazinyl carboxamide derivatives as JAK inhibitors US Patent  US9611269 Publication Date 4/4/2017 
Target
Name:
Tyrosine-protein kinase JAK1
Synonyms:
JAK-1 JAK1A JAK1_HUMAN Janus kinase 1 (JAK1) | Janus kinase 1 JAK1
Type:
Protein
Mol. Mass.:
133293.73
Organism:
Homo sapiens (Human)
Description:
P23458
Residue:
1154
  
Inhibitor
Name:
BDBM314711
Synonyms:
US10513522, Example 24 US9611269, Example 24
Type:
Small organic molecule
Emp. Form.:
C22H21N9O
Mol. Mass.:
427.4618
SMILES:
CCNC(=O)c1ccc(cn1)N1CC(CC#N)(C1)n1cc(cn1)-c1ncnc2[nH]ccc12
: