Target
Tyrosine-protein kinase JAK2
Ligand
BDBM314716
Substrate
Meas. Tech.
In Vitro Assay
IC50
<10±n/a nM
Citation
 Yao, WBurns, DZhuo, J Azetidinyl phenyl, pyridyl or pyrazinyl carboxamide derivatives as JAK inhibitors US Patent  US9611269 Publication Date 4/4/2017 
Target
Name:
Tyrosine-protein kinase JAK2
Synonyms:
JAK-2 JAK2_HUMAN Janus kinase 2 (JAK2) | Janus kinase 2 (a protein tyrosine kinase)
Type:
Protein
Mol. Mass.:
130684.68
Organism:
Homo sapiens (Human)
Description:
O60674
Residue:
1132
  
Inhibitor
Name:
BDBM314716
Synonyms:
US10513522, Example 29 US9611269, Example 29
Type:
Small organic molecule
Emp. Form.:
C24H19F5N8O
Mol. Mass.:
530.4527
SMILES:
C[C@@H](NC(=O)c1cc(F)c(cc1F)N1CC(CC#N)(C1)n1cc(cn1)-c1ncnc2[nH]ccc12)C(F)(F)F
: