Target
cAMP and cAMP-inhibited cGMP 3',5'-cyclic phosphodiesterase 10A
Ligand
BDBM179983
Substrate
Meas. Tech.
In Vitro Assay PDE10A
pH
7.8±n/a
Temperature
298.15±n/a K
IC50
4200±n/a nM
Comments
extracted
Citation
 Megens, AALanglois, XJAndrés-Gil, JI Combinations comprising PDE 2 inhibitors such as 1-aryl-4-methyl-[1,2,4]triazolo-[4,3-A]]quinoxaline compounds and PDE 10 inhibitors for use in the treatment of neurological of metabolic disorders US Patent  US9669035 Publication Date 6/6/2017 
Target
Name:
cAMP and cAMP-inhibited cGMP 3',5'-cyclic phosphodiesterase 10A
Synonyms:
PDE10_RAT Phosphodiesterase 10 Phosphodiesterase Type 10 (PDE10A) | Rat recombinant PDE10a (rPDE10a)
Type:
Enzyme
Mol. Mass.:
90160.88
Organism:
Rattus norvegicus (rat)
Description:
PDE10A was generated from the full-length recombinant rat clone transfected into Sf9 cells.
Residue:
794
  
Inhibitor
Name:
BDBM179983
Synonyms:
US9669035, B-20
Type:
Small organic molecule
Emp. Form.:
C24H28ClN5O
Mol. Mass.:
437.965
SMILES:
CCCCOc1ccc(Cl)c(c1)-c1nnc2c(C)nc3ccc(CNC(C)C)cc3n12
: