Target
Cholinesterase
Ligand
BDBM10691
Substrate
BDBM8978
Meas. Tech.
Cholinesterase Inhibition Assay
IC50
21.8±n/a nM
Citation
 Yu, QGreig, NHHolloway, HWBrossi, A Syntheses and anticholinesterase activities of (3aS)-N1, N8-bisnorphenserine, (3aS)-N1,N8-bisnorphysostigmine, their antipodal isomers, and other potential metabolites of phenserine. J Med Chem 41:2371-9 (1998)  
Target
Name:
Cholinesterase
Synonyms:
Acylcholine acylhydrolase Butyrylcholine esterase (BChE) Butyrylcholinesterase (BuChE) CHLE_HUMAN Cholinesterases Pseudocholinesterase
Type:
Homotetramer
Mol. Mass.:
68422.27
Organism:
Homo sapiens (Human)
Description:
P06276
Residue:
602
  
Inhibitor
Name:
BDBM10691
Synonyms:
(-)-N1-benzylnorphysostigmine CHEMBL80221
Type:
Small organic molecule
Emp. Form.:
C21H25N3O2
Mol. Mass.:
351.4421
SMILES:
CNC(=O)Oc1ccc2N(Cc3ccccc3)C3N(C)CC[C@@]3(C)c2c1
:
Substrate
Name:
BDBM8978
Synonyms:
(Propylcarbonylthioethyl)trimethylammonium iodide CHEMBL148530 butyrylthiocholine | butyrylthiocholine chloride
Type:
Small organic molecule
Emp. Form.:
C9H20NOS
Mol. Mass.:
190.326
SMILES:
CCCC(=O)SCC[N+](C)(C)C
: