Target
Steroid 21-hydroxylase
Ligand
BDBM25458
Substrate
Meas. Tech.
Enzyme Activity Assay
IC50
296±26 nM
Citation
 Aube, JScott, EEFehl, C Inhibitors of CYP17A1 US Patent  US9611270 Publication Date 4/4/2017 
Target
Name:
Steroid 21-hydroxylase
Synonyms:
CP21A_HUMAN CYP21A2 Cytochrome P450 21 | Cytochrome P450 21A2
Type:
PROTEIN
Mol. Mass.:
55896.25
Organism:
Homo sapiens (Human)
Description:
ChEMBL_1498865
Residue:
494
  
Inhibitor
Name:
BDBM25458
Synonyms:
(1S,2R,5S,10R,11S,15S)-2,15-dimethyl-14-(pyridin-3-yl)tetracyclo[8.7.0.0^{2,7}.0^{11,15}]heptadeca-7,13-dien-5-ol Abiraterone CHEMBL254328 US9611270, Example 5, abiraterone
Type:
steroidal compound
Emp. Form.:
C24H31NO
Mol. Mass.:
349.509
SMILES:
[H][C@@]12CC=C(c3cccnc3)[C@@]1(C)CC[C@@]1([H])[C@@]2([H])CC=C2C[C@@H](O)CC[C@]12C
: