Target
Steroid 21-hydroxylase
Ligand
BDBM314739
Substrate
Meas. Tech.
Enzyme Activity Assay
IC50
831±96 nM
Citation
 Aube, JScott, EEFehl, C Inhibitors of CYP17A1 US Patent  US9611270 Publication Date 4/4/2017 
Target
Name:
Steroid 21-hydroxylase
Synonyms:
CP21A_HUMAN CYP21A2 Cytochrome P450 21 | Cytochrome P450 21A2
Type:
PROTEIN
Mol. Mass.:
55896.25
Organism:
Homo sapiens (Human)
Description:
ChEMBL_1498865
Residue:
494
  
Inhibitor
Name:
BDBM314739
Synonyms:
US9611270, Example 39 | US9611270, Example 41
Type:
Small organic molecule
Emp. Form.:
C24H30N2O3
Mol. Mass.:
394.5066
SMILES:
C[C@]12CC[C@H]3[C@@H](CC(=C4C[C@@H](O)CC[C@]34C)[N+]([O-])=O)[C@@H]1CC=C2c1cccnc1
: