Target
Protein O-GlcNAcase
Ligand
BDBM314752
Substrate
Meas. Tech.
Enzymatic Assay
Ki
3.31±n/a nM
Citation
 Selnick, HGLi, WHostetler, ELiu, KMcEachern, EJZhou, YWei, ZMu, CWang, YChang, J Permeable glycosidase inhibitors and uses thereof US Patent  US9611275 Publication Date 4/4/2017 
Target
Name:
Protein O-GlcNAcase
Synonyms:
2-acetamido-2-deoxy-β-D-glucopyranosidase (O-GlcNAcase) Beta-hexosaminidase (O-GlcNAcase) HEXC MEA5 N-acetyl-beta-D-glucosaminidase (O-GlcNAcase) OGA Protein O-GlcNAcase
Type:
Enzyme
Mol. Mass.:
102874.67
Organism:
Homo sapiens (Human)
Description:
O60502
Residue:
916
  
Inhibitor
Name:
BDBM314752
Synonyms:
US9611275, Example 21
Type:
Small organic molecule
Emp. Form.:
C17H21F3N2O5S
Mol. Mass.:
422.419
SMILES:
CN(C)C1=N[C@H]2[C@H](O[C@H]([C@@H](OCc3ccc(O)cc3)C(F)(F)F)[C@@H](O)[C@@H]2O)S1
: