Target
Protein O-GlcNAcase
Ligand
BDBM314797
Substrate
Meas. Tech.
Enzymatic Assay
Ki
1.44±n/a nM
Citation
 Selnick, HGLi, WHostetler, ELiu, KMcEachern, EJZhou, YWei, ZMu, CWang, YChang, J Permeable glycosidase inhibitors and uses thereof US Patent  US9611275 Publication Date 4/4/2017 
Target
Name:
Protein O-GlcNAcase
Synonyms:
2-acetamido-2-deoxy-β-D-glucopyranosidase (O-GlcNAcase) Beta-hexosaminidase (O-GlcNAcase) HEXC MEA5 N-acetyl-beta-D-glucosaminidase (O-GlcNAcase) OGA Protein O-GlcNAcase
Type:
Enzyme
Mol. Mass.:
102874.67
Organism:
Homo sapiens (Human)
Description:
O60502
Residue:
916
  
Inhibitor
Name:
BDBM314797
Synonyms:
(3aR,5S,6S,7R,7aR)-2- (methylamino)-5-((R)-2,2,2- trifluoro-1-(4- fluorobenzyloxy)ethyl)-5,6,7,7a- tetrahydro-3aH-pyrano[3,2- d]thiazole-6,7-diol | US9611275, Example 89
Type:
Small organic molecule
Emp. Form.:
C16H18F4N2O4S
Mol. Mass.:
410.384
SMILES:
CNC1=N[C@H]2[C@H](O[C@H]([C@@H](OCc3ccc(F)cc3)C(F)(F)F)[C@@H](O)[C@@H]2O)S1
: