Target
Orexin/Hypocretin receptor type 1
Ligand
BDBM314927
Substrate
Meas. Tech.
Radioligand Binding Assay
Ki
3.00±n/a nM
Citation
 Gelin, CFLebold, TPShireman, BTZiff, JM Substituted 2-azabicycles and their use as orexin receptor modulators US Patent  US9611277 Publication Date 4/4/2017 
Target
Name:
Orexin/Hypocretin receptor type 1
Synonyms:
Hcrtr1 OX1R_RAT Orexin receptor type 1 (OX1R) Ox1-R | Ox1R
Type:
Protein
Mol. Mass.:
46817.55
Organism:
Rattus norvegicus (Rat)
Description:
P56718
Residue:
416
  
Inhibitor
Name:
BDBM314927
Synonyms:
((1S,4R,6R)-6-((5-bromopyridin-2-yl)oxy)-2-azabicyclo[2.2.1]heptan-2-yl)(3-fluoro-2-(2H-1,2,3-triazol-2-yl)phenyl)methanone US9611277, Example 106
Type:
Small organic molecule
Emp. Form.:
C20H17BrFN5O2
Mol. Mass.:
458.284
SMILES:
Fc1cccc(C(=O)N2CC3CC(Oc4ccc(Br)cn4)C2C3)c1-n1nccn1
: