Target
Orexin/Hypocretin receptor type 1
Ligand
BDBM314967
Substrate
Meas. Tech.
Radioligand Binding Assay
Ki
3.00±n/a nM
Citation
 Gelin, CFLebold, TPShireman, BTZiff, JM Substituted 2-azabicycles and their use as orexin receptor modulators US Patent  US9611277 Publication Date 4/4/2017 
Target
Name:
Orexin/Hypocretin receptor type 1
Synonyms:
HCRTR1 OX1R_HUMAN Orexin receptor type 1 (OR 1) Orexin receptor type 1 (OX1) Orexin receptor type 1 (OxR1) | Ox1r
Type:
Protein
Mol. Mass.:
47554.50
Organism:
Homo sapiens (Human)
Description:
O43613
Residue:
425
  
Inhibitor
Name:
BDBM314967
Synonyms:
(2-fluoro-6-(2H-1,2,3-triazol-2-yl)phenyl)((1S,4S,6R)-6-((5-(trifluoromethyl)pyridin-2-yl)amino)-2-azabicyclo[2.2.1]heptan-2-yl)methanone US9611277, Example 146
Type:
Small organic molecule
Emp. Form.:
C21H18F4N6O
Mol. Mass.:
446.4008
SMILES:
Fc1cccc(c1C(=O)N1CC2CC(Nc3ccc(cn3)C(F)(F)F)C1C2)-n1nccn1
: