Target
Prostaglandin G/H synthase 2
Ligand
BDBM315254
Substrate
Meas. Tech.
Human PTGES Biochemical Enzyme Inhibition Assay
IC50
20.8±n/a nM
Citation
 Bräuer, NNagel, JIrlbacher, HRotgeri, ASchwede, WDahllöf, HKoppitz, MPeters, MGodinho-Coelho, A Substituted pyridyl-cycloalkyl-carboxylic acids, compositions containing them and medical uses thereof US Patent  US10172814 Publication Date 1/8/2019 
Target
Name:
Prostaglandin G/H synthase 2
Synonyms:
COX2 Cyclooxygenase 2 (COX-2) Cyclooxygenase-2 (COX-2 AA) Cyclooxygenase-2 (COX-2) PGH2_HUMAN PHS II Prostaglandin E synthase/G/H synthase 2 Prostaglandin-endoperoxide synthase 2
Type:
Enzyme
Mol. Mass.:
69003.89
Organism:
Homo sapiens (Human)
Description:
Recombinant Cox-2 provided by Cayman (Cayman Chemical Co.,Ann Arbor, MI).
Residue:
604
  
Inhibitor
Name:
BDBM315254
Synonyms:
3-[3-({(2R)-2-cyclopentyl-2-[4-(5-ethylpyridin-3-yl)phenyl]acetyl}amino)-2-methylphenyl]pentanoic acid, Single Enantiomer | US10172814, Example 204
Type:
Small organic molecule
Emp. Form.:
C32H38N2O3
Mol. Mass.:
498.6557
SMILES:
CCC(CC(O)=O)c1cccc(NC(=O)[C@H](C2CCCC2)c2ccc(cc2)-c2cncc(CC)c2)c1C
: