Target
Eukaryotic initiation factor 4A-III
Ligand
BDBM65492
Substrate
Meas. Tech.
ATPase enzyme assay
IC50
2.2e+3±n/a nM
Citation
 Iwatani-Yoshihara, MIto, MIshibashi, YOki, HTanaka, TMorishita, DIto, TKimura, HImaeda, YAparicio, SNakanishi, AKawamoto, T Discovery and Characterization of a Eukaryotic Initiation Factor 4A-3-Selective Inhibitor That Suppresses Nonsense-Mediated mRNA Decay. ACS Chem Biol 12:1760-1768 (2017)  
Target
Name:
Eukaryotic initiation factor 4A-III
Synonyms:
ATP-dependent RNA helicase DDX48 DDX48 EIF4A3 Eukaryotic translation initiation factor 4A isoform 3 KIAA0111 Nuclear matrix protein 265 eIF4A-III | hNMP 265
Type:
Protein
Mol. Mass.:
46871.02
Organism:
Homo sapiens (Human)
Description:
P38919
Residue:
411
  
Inhibitor
Name:
BDBM65492
Synonyms:
eIF4A3 inhibitor, 1
Type:
Small organic molecule
Emp. Form.:
C27H21Cl2N3O3
Mol. Mass.:
506.38
SMILES:
Clc1ccc(cc1)C1CN(CCN1C(=O)c1ccc(Cl)cc1)C(=O)c1cnc(o1)-c1ccccc1
: