Target
Eukaryotic initiation factor 4A-I
Ligand
BDBM65493
Substrate
Meas. Tech.
ATPase enzyme assay
IC50
>1.00e+5±n/a nM
Citation
 Iwatani-Yoshihara, MIto, MIshibashi, YOki, HTanaka, TMorishita, DIto, TKimura, HImaeda, YAparicio, SNakanishi, AKawamoto, T Discovery and Characterization of a Eukaryotic Initiation Factor 4A-3-Selective Inhibitor That Suppresses Nonsense-Mediated mRNA Decay. ACS Chem Biol 12:1760-1768 (2017)  
Target
Name:
Eukaryotic initiation factor 4A-I
Synonyms:
ATP-dependent RNA helicase eIF4A-1 EIF4A IF4A1_HUMAN eIF4A-I
Type:
PROTEIN
Mol. Mass.:
46146.87
Organism:
Homo sapiens (Human)
Description:
ChEMBL_864983
Residue:
406
  
Inhibitor
Name:
BDBM65493
Synonyms:
eIF4A3 inhibitor, 2
Type:
Small organic molecule
Emp. Form.:
C25H19Br2ClN4O2
Mol. Mass.:
602.705
SMILES:
Clc1ccc(cc1)[C@H]1CN(CCN1C(=O)c1ccc(Br)cc1)C(=O)c1cnn2cc(Br)ccc12
: