Target
Genome polyprotein
Ligand
BDBM179850
Substrate
Meas. Tech.
HCV Replicon Assay Luciferase
Temperature
310.15±n/a K
EC50
55±n/a nM
Comments
extracted
Citation
 Wang, GKim, IJOr, YS Cyclosporin analogues for preventing or treating hepatitis C infection US Patent  US9669095 Publication Date 6/6/2017 
Target
Name:
Genome polyprotein
Synonyms:
Dipeptidyl peptidase 4 (DPP4) NS3 NS5B NS3-4A Protease NS3/4A protease POLG_HCV77 | RNA polymerase (NS5B)
Type:
Protease Domain
Mol. Mass.:
327221.49
Organism:
Hepatitis C virus (HCV genotype 1a, isolate H)
Description:
P27958
Residue:
3011
  
Inhibitor
Name:
BDBM179850
Synonyms:
US9669095, 2
Type:
Small organic molecule
Emp. Form.:
C62H111N11O13
Mol. Mass.:
1218.6106
SMILES:
CCCC[C@@H](C)C(=O)[C@@H]1NC(=O)[C@H](C(C)C)N(C)C(=O)[C@H](CC(C)C)N(C)C(=O)[C@H](CC(C)C)N(C)C(=O)[C@@H](C)NC(=O)[C@H](C)NC(=O)[C@H](CC(C)C)N(C)C(=O)[C@@H](NC(=O)[C@@H](N(C)C(=O)[C@@H](C)N(C)C(=O)[C@H](CC)NC1=O)C(C)(C)CO)C(C)C
: