Target
Histamine H4 receptor
Ligand
BDBM315374
Substrate
Meas. Tech.
Binding Assay on Recombinant Human Histamine H4 Receptor
Ki
46.0±n/a nM
Citation
 Bacani, GMChai, WEdwards, JPSmith, RCTichenor, MSVenable, JDWei, J 2,4-diaminopyrimidine derivatives as histamine H4 modulators US Patent  US10172856 Publication Date 1/8/2019 
Target
Name:
Histamine H4 receptor
Synonyms:
AXOR35 GPCR105 HH4R HRH4 Histamine H4 receptor Histamine receptor (H3 and H4) SP9144
Type:
G Protein-Coupled Receptor (GPCR)
Mol. Mass.:
44517.02
Organism:
Homo sapiens (Human)
Description:
Binding assays were using CHO cells stably expressing hH4R receptors.
Residue:
390
  
Inhibitor
Name:
BDBM315374
Synonyms:
US10172856, Example 27
Type:
Small organic molecule
Emp. Form.:
C21H29N5O2S
Mol. Mass.:
415.552
SMILES:
[#6]-[#6](-[#6])-[#7](-c1ccnc(-[#7])n1)-c1ccc(cc1\[#6]=[#6](/[#6])-[#6])S(=O)(=O)[#7]-1-[#6]-[#6]-[#6]-[#6]-1
: