Target
Histamine H4 receptor
Ligand
BDBM315385
Substrate
Meas. Tech.
Binding Assay on Recombinant Human Histamine H4 Receptor
Ki
12.0±n/a nM
Citation
 Bacani, GMChai, WEdwards, JPSmith, RCTichenor, MSVenable, JDWei, J 2,4-diaminopyrimidine derivatives as histamine H4 modulators US Patent  US10172856 Publication Date 1/8/2019 
Target
Name:
Histamine H4 receptor
Synonyms:
AXOR35 GPCR105 HH4R HRH4 Histamine H4 receptor Histamine receptor (H3 and H4) SP9144
Type:
G Protein-Coupled Receptor (GPCR)
Mol. Mass.:
44517.02
Organism:
Homo sapiens (Human)
Description:
Binding assays were using CHO cells stably expressing hH4R receptors.
Residue:
390
  
Inhibitor
Name:
BDBM315385
Synonyms:
US10172856, Example 37
Type:
Small organic molecule
Emp. Form.:
C17H15ClF5N5S
Mol. Mass.:
451.845
SMILES:
Cc1cc(ccc1N(Cc1ncccc1Cl)c1ccnc(N)n1)S(F)(F)(F)(F)F
: