Target
Histamine H4 receptor
Ligand
BDBM315428
Substrate
Meas. Tech.
Binding Assay on Recombinant Human Histamine H4 Receptor
Ki
65.0±n/a nM
Citation
 Bacani, GMChai, WEdwards, JPSmith, RCTichenor, MSVenable, JDWei, J 2,4-diaminopyrimidine derivatives as histamine H4 modulators US Patent  US10172856 Publication Date 1/8/2019 
Target
Name:
Histamine H4 receptor
Synonyms:
AXOR35 GPCR105 HH4R HRH4 Histamine H4 receptor Histamine receptor (H3 and H4) SP9144
Type:
G Protein-Coupled Receptor (GPCR)
Mol. Mass.:
44517.02
Organism:
Homo sapiens (Human)
Description:
Binding assays were using CHO cells stably expressing hH4R receptors.
Residue:
390
  
Inhibitor
Name:
BDBM315428
Synonyms:
US10172856, Example 80
Type:
Small organic molecule
Emp. Form.:
C19H27N5O2S
Mol. Mass.:
389.515
SMILES:
CCN(C)S(=O)(=O)c1ccc(N(CC)c2ccnc(N)n2)c(c1)C1CCC1
: