Target
Histamine H4 receptor
Ligand
BDBM315471
Substrate
Meas. Tech.
Binding Assay on Recombinant Human Histamine H4 Receptor
Ki
7.00±n/a nM
Citation
 Bacani, GMChai, WEdwards, JPSmith, RCTichenor, MSVenable, JDWei, J 2,4-diaminopyrimidine derivatives as histamine H4 modulators US Patent  US10172856 Publication Date 1/8/2019 
Target
Name:
Histamine H4 receptor
Synonyms:
AXOR35 GPCR105 HH4R HRH4 Histamine H4 receptor Histamine receptor (H3 and H4) SP9144
Type:
G Protein-Coupled Receptor (GPCR)
Mol. Mass.:
44517.02
Organism:
Homo sapiens (Human)
Description:
Binding assays were using CHO cells stably expressing hH4R receptors.
Residue:
390
  
Inhibitor
Name:
BDBM315471
Synonyms:
US10172856, Example 119
Type:
Small organic molecule
Emp. Form.:
C16H21FN4
Mol. Mass.:
288.3631
SMILES:
CCCc1cc(F)ccc1N(C(C)C)c1ccnc(N)n1
: