Target
Phosphatidylinositol 4,5-bisphosphate 3-kinase catalytic subunit delta isoform
Ligand
BDBM315566
Substrate
Meas. Tech.
In vitro kinase assay
IC50
<25±n/a nM
Citation
 Liu, YRen, PJessen, KGuo, XRommel, C Combination pharmaceutical compositions and uses thereof US Patent  US10172858 Publication Date 1/8/2019 
Target
Name:
Phosphatidylinositol 4,5-bisphosphate 3-kinase catalytic subunit delta isoform
Synonyms:
PI3-kinase p110 subunit delta PI3-kinase subunit p110-delta PIK3CD Phosphatidylinositol 4,5-biphosphate 3-kinase catalytic subunit delta (PIK3CD) Phosphatidylinositol 4,5-bisphosphate 3-kinase 110 kDa catalytic subunit delta (PI3K delta) Phosphatidylinositol 4,5-bisphosphate 3-kinase catalytic subunit delta (PI3Kdelta) Phosphatidylinositol 4,5-bisphosphate 3-kinase catalytic subunit delta isoform (PI3K delta) Phosphatidylinositol 4,5-bisphosphate 3-kinase catalytic subunit delta isoform (PI3K-delta) Phosphatidylinositol 4,5-bisphosphate 3-kinase catalytic subunit delta isoform (PI3Kdelta)
Type:
Enzyme Subunit
Mol. Mass.:
119489.41
Organism:
Homo sapiens (Human)
Description:
O00329
Residue:
1044
  
Inhibitor
Name:
BDBM315566
Synonyms:
US10172858, Table 2.63 | US9828378, # 63
Type:
Small organic molecule
Emp. Form.:
C19H20N6O2
Mol. Mass.:
364.4011
SMILES:
COc1cccc2cc([nH]c12)-c1nn(C2CCOCC2)c2ncnc(N)c12
: