Target
Phosphatidylinositol 4,5-bisphosphate 3-kinase catalytic subunit gamma isoform
Ligand
BDBM315572
Substrate
Meas. Tech.
In vitro kinase assay
IC50
<50±n/a nM
Citation
 Liu, YRen, PJessen, KGuo, XRommel, C Combination pharmaceutical compositions and uses thereof US Patent  US10172858 Publication Date 1/8/2019 
Target
Name:
Phosphatidylinositol 4,5-bisphosphate 3-kinase catalytic subunit gamma isoform
Synonyms:
PI3-kinase p110 subunit gamma PI3Kgamma PK3CG_HUMAN Phosphatidylinositol 4,5-bisphosphate 3-kinase (PI3K) Phosphatidylinositol 4,5-bisphosphate 3-kinase catalytic subunit gamma (PI3Kgamma) Phosphatidylinositol 4,5-bisphosphate 3-kinase catalytic subunit gamma isoform (PI3K) Phosphatidylinositol-4,5-bisphosphate 3-kinase catalytic subunit gamma isoform Phosphoinositide 3-kinases gamma (PI3K gamma) p120-PI3K
Type:
Enzyme Subunit
Mol. Mass.:
126470.30
Organism:
Homo sapiens (Human)
Description:
P48736
Residue:
1102
  
Inhibitor
Name:
BDBM315572
Synonyms:
US10172858, Table 2.68 | US9828378, # 68
Type:
Small organic molecule
Emp. Form.:
C18H17ClN6O2
Mol. Mass.:
384.82
SMILES:
Nc1ncnc2n(nc(-c3cc4cc(O)cc(Cl)c4[nH]3)c12)C1CCOCC1
: