Target
DNA-dependent protein kinase catalytic subunit
Ligand
BDBM315668
Substrate
Meas. Tech.
DNA-PK Assay (Biochemical)
IC50
5±n/a nM
Citation
 Fuchss, TEmde, UBuchstaller, HMederski, W Arylquinazolines US Patent  US10172859 Publication Date 1/8/2019 
Target
Name:
DNA-dependent protein kinase catalytic subunit
Synonyms:
DNA-PK catalytic subunit DNA-dependent protein kinase (DNA-PK) DNA-dependent protein kinase catalytic subunit (DNA-PK) HYRC PRKDC | PRKDC_HUMAN
Type:
Protein
Mol. Mass.:
469114.78
Organism:
Homo sapiens (Human)
Description:
P78527
Residue:
4128
  
Inhibitor
Name:
BDBM315668
Synonyms:
6-{[2-Chloro-4-fluoro-5- (7-morpholin-4-yl- quinazolin-4-yl)phenyl]- hydroxymethyl}-2-ethyl- 2H-pyridazin-3-one1H NMR (500 MHz, DMSO-d6) ppm = 9.13 (s, 1H),7.94 (d, J = 7.7, 1H), 7.68 (d, J = 9.5, 1H), 7.59-7.52(m, 2H), 7.46 (d, J = 9.6, 1H), 7.22 (d, J = 2.3, 1H),6.92 (d, J = 9.6, 1H), 6.61 (d, J = 4.8, 1H), 5.90 (d,J = 4.8, 1H), 4.08-3.95 (m, 2H), 3.81-3.74 (m, 4H),3.49-3.41 (m, 4H), 1.20 (t, J = 7.2, 3H) US10172859, Example 96 US11065253, Example 97 | US9732094, Example 97
Type:
Small organic molecule
Emp. Form.:
C25H23ClFN5O3
Mol. Mass.:
495.933
SMILES:
CCn1nc(ccc1=O)C(O)c1cc(c(F)cc1Cl)-c1ncnc2cc(ccc12)N1CCOCC1
: