Target
Potassium voltage-gated channel subfamily H member 2
Ligand
BDBM315676
Substrate
Meas. Tech.
Kv11.1 (hERG) ION CHANNEL ACTIVITY (Patch Clamp Assay)
Ki
12500±n/a nM
Citation
 Fuchss, TEmde, UBuchstaller, HMederski, W Arylquinazolines US Patent  US10172859 Publication Date 1/8/2019 
Target
Name:
Potassium voltage-gated channel subfamily H member 2
Synonyms:
1,3-beta-glucan synthase component GLS2 ERG Eag-related protein 1 Ether-a-go-go-related gene (HERG) Ether-a-go-go-related gene potassium channel 1 Ether-a-go-go-related gene potassium channel 1 (hERG1) Ether-a-go-go-related protein 1 H-ERG KCNH2 Potassium voltage-gated channel subfamily H member 2 (hERG) Voltage-gated potassium channel subunit Kv11.1 hERG Potassium Channel 1 | putative potassium channel subunit
Type:
Multi-pass membrane protein
Mol. Mass.:
126672.65
Organism:
Homo sapiens (Human)
Description:
Q12809
Residue:
1159
  
Inhibitor
Name:
BDBM315676
Synonyms:
2-(6-{[2-Chloro-4- fluoro-5-(7- morpholin-4-yl- quinazolin-4-yl)- phenyl]hydroxy- methyl}pyridazin-3- yloxy)propionitrile1H NMR (500 MHz, DMSO-d6) ppm = 9.12 (d,J = 2.7, 1H), 7.93 (dd, J = 11.2, 7.7, 1H), 7.84 (dd,J = 16.3, 9.2, 1H), 7.70-7.65 (m, 1H), 7.63-7.57 (m, 1H), 7.57-7.51 (m, 1H), 7.38 (dd,J = 9.1, 3.5, 1H), 7.21 (d, J = 2.4, 1H), 6.71 (dd,J = 10.3, 5.0, 1H), 6.28 (dd, J = 9.5, 5.0, 1H), 5.95-5.87 (m, 1H), 3.81-3.74 (m, 4H), 3.48-3.42(m, 4H), 1.76-1.70 (m, 3H) US10172859, Example 102 US10172859, Example 104 US9732094, Example 104
Type:
Small organic molecule
Emp. Form.:
C26H22ClFN6O3
Mol. Mass.:
520.943
SMILES:
CC(Oc1ccc(nn1)C(O)c1cc(c(F)cc1Cl)-c1ncnc2cc(ccc12)N1CCOCC1)C#N
: