Target
DNA-dependent protein kinase catalytic subunit
Ligand
BDBM315831
Substrate
Meas. Tech.
DNA-PK Assay (Biochemical)
IC50
<3±n/a nM
Citation
 Fuchss, TEmde, UBuchstaller, HMederski, W Arylquinazolines US Patent  US10172859 Publication Date 1/8/2019 
Target
Name:
DNA-dependent protein kinase catalytic subunit
Synonyms:
DNA-PK catalytic subunit DNA-dependent protein kinase (DNA-PK) DNA-dependent protein kinase catalytic subunit (DNA-PK) HYRC PRKDC | PRKDC_HUMAN
Type:
Protein
Mol. Mass.:
469114.78
Organism:
Homo sapiens (Human)
Description:
P78527
Residue:
4128
  
Inhibitor
Name:
BDBM315831
Synonyms:
US10172859, Example 252 US10172859, Example 267 US9732094, Example 267 | [4-Fluoro-3-(5-fluoro- 7-morpholin-4-yl- quinazolin-4-yl)- phenyl]-(3-methoxy- pyrazin-2-yl)- methanol (Ena 2)see racemate
Type:
Small organic molecule
Emp. Form.:
C24H21F2N5O3
Mol. Mass.:
465.452
SMILES:
COc1nccnc1C(O)c1ccc(F)c(c1)-c1ncnc2cc(cc(F)c12)N1CCOCC1
: