Target
Potassium voltage-gated channel subfamily H member 2
Ligand
BDBM315863
Substrate
Meas. Tech.
Kv11.1 (hERG) ION CHANNEL ACTIVITY (Patch Clamp Assay)
Ki
<10000±n/a nM
Citation
 Fuchss, TEmde, UBuchstaller, HMederski, W Arylquinazolines US Patent  US10172859 Publication Date 1/8/2019 
Target
Name:
Potassium voltage-gated channel subfamily H member 2
Synonyms:
1,3-beta-glucan synthase component GLS2 ERG Eag-related protein 1 Ether-a-go-go-related gene (HERG) Ether-a-go-go-related gene potassium channel 1 Ether-a-go-go-related gene potassium channel 1 (hERG1) Ether-a-go-go-related protein 1 H-ERG KCNH2 Potassium voltage-gated channel subfamily H member 2 (hERG) Voltage-gated potassium channel subunit Kv11.1 hERG Potassium Channel 1 | putative potassium channel subunit
Type:
Multi-pass membrane protein
Mol. Mass.:
126672.65
Organism:
Homo sapiens (Human)
Description:
Q12809
Residue:
1159
  
Inhibitor
Name:
BDBM315863
Synonyms:
2-(4-Chlorothieno- [2,3-d}pyridazin-7-yl)- 2-[4-fluoro-3-(7- morpholin-4-yl- quinazolin-4-yl)- phenyl]acetamide1H NMR (500 MHz, DMSO-d6) ppm = 9.09 (s,1H), 8.41 (d, J = 5.4, 1H), 7.94 (s, 1H), 7.71-7.65(m, 3H), 7.56 (dd, J = 9.4, 3.1, 1H), 7.51 (dd,J = 9.4, 2.5, 1H), 7.48-7.40 (m, 2H), 7.20 (d,J = 2.4, 1H), 5.75 (s, 1H), 3.82-3.73 (m, 4H), 3.48-3.40 (m, 4H). US11065253, Example 290 | US9732094, Example 290
Type:
Small organic molecule
Emp. Form.:
C26H20ClFN6O2S
Mol. Mass.:
534.992
SMILES:
NC(=O)C(c1ccc(F)c(c1)-c1ncnc2cc(ccc12)N1CCOCC1)c1nnc(Cl)c2ccsc12
: